Information card for entry 7211915
Formula |
C32 H36 Co5 O28 |
Calculated formula |
C32 H34 Co5 O28 |
Title of publication |
Coordination polymers of biphenyl-2,4,2′,4′-tetracarboxylic acid—synthesis, structures and adsorption properties |
Authors of publication |
Jia, Juan; Shao, Min; Jia, Tiantian; Zhu, Shourong; Zhao, Yongmei; Xing, Feifei; Li, Mingxing |
Journal of publication |
CrystEngComm |
Year of publication |
2010 |
Journal volume |
12 |
Journal issue |
5 |
Pages of publication |
1548 |
a |
8.6129 ± 0.001 Å |
b |
19.542 ± 0.002 Å |
c |
11.4698 ± 0.0013 Å |
α |
90° |
β |
90.564 ± 0.001° |
γ |
90° |
Cell volume |
1930.4 ± 0.4 Å3 |
Cell temperature |
273 ± 2 K |
Ambient diffraction temperature |
273 ± 2 K |
Number of distinct elements |
4 |
Space group number |
14 |
Hermann-Mauguin space group symbol |
P 1 21/n 1 |
Hall space group symbol |
-P 2yn |
Residual factor for all reflections |
0.0512 |
Residual factor for significantly intense reflections |
0.0366 |
Weighted residual factors for significantly intense reflections |
0.062 |
Weighted residual factors for all reflections included in the refinement |
0.0659 |
Goodness-of-fit parameter for all reflections included in the refinement |
0.905 |
Diffraction radiation wavelength |
0.71073 Å |
Diffraction radiation type |
MoKα |
Yes |
No |
No |