Information card for entry 7212039
Formula | C56 H44 N8 O17 Zn3 |
Calculated formula | C56 H44 N8 O17 Zn3 |
Title of publication | pH-dependent self-assembly of divalent metals with a new ligand containing polycarboxylate: syntheses, crystal structures, luminescent and magnetic properties |
Authors of publication | Chen, Lei; Xu, Guang-Juan; Shao, Kui-Zhan; Zhao, Ya-Hui; Yang, Guang-Sheng; Lan, Ya-Qian; Wang, Xin-Long; Xu, Hong-Bin; Su, Zhong-Min |
Journal of publication | CrystEngComm |
Year of publication | 2010 |
Journal volume | 12 |
Journal issue | 7 |
Pages of publication | 2157 |
a | 13.345 ± 0.004 Å |
b | 16.436 ± 0.002 Å |
c | 25.792 ± 0.005 Å |
α | 90° |
β | 90.127 ± 0.003° |
γ | 90° |
Cell volume | 5657 ± 2 Å3 |
Cell temperature | 293 ± 2 K |
Ambient diffraction temperature | 293 ± 2 K |
Number of distinct elements | 5 |
Space group number | 14 |
Hermann-Mauguin space group symbol | P 1 21/n 1 |
Hall space group symbol | -P 2yn |
Residual factor for all reflections | 0.0707 |
Residual factor for significantly intense reflections | 0.037 |
Weighted residual factors for significantly intense reflections | 0.078 |
Weighted residual factors for all reflections included in the refinement | 0.0897 |
Goodness-of-fit parameter for all reflections included in the refinement | 1.01 |
Diffraction radiation wavelength | 0.71069 Å |
Diffraction radiation type | MoKα |