Information card for entry 7212040
Formula | C42 H24 S6 |
Calculated formula | C42 H24 S6 |
SMILES | c1(c(cc2c(c1)c1c(cc(c(c1)c1sccc1)c1sccc1)c1c2cc(c2sccc2)c(c1)c1sccc1)c1cccs1)c1sccc1 |
Title of publication | Synthesis, physical properties and self-assembly of star-shaped oligothiophenes-substituted and fused triphenylenes |
Authors of publication | Luo, Jing; Zhao, Baomin; On Chan, Hardy Sze; Chi, Chunyan |
Journal of publication | Journal of Materials Chemistry |
Year of publication | 2010 |
Journal volume | 20 |
Journal issue | 10 |
Pages of publication | 1932 |
a | 28.047 ± 0.003 Å |
b | 16.0284 ± 0.0013 Å |
c | 7.4162 ± 0.0006 Å |
α | 90° |
β | 101.761 ± 0.002° |
γ | 90° |
Cell volume | 3264 ± 0.5 Å3 |
Cell temperature | 293 ± 2 K |
Ambient diffraction temperature | 293 ± 2 K |
Number of distinct elements | 3 |
Space group number | 15 |
Hermann-Mauguin space group symbol | C 1 2/c 1 |
Hall space group symbol | -C 2yc |
Residual factor for all reflections | 0.0763 |
Residual factor for significantly intense reflections | 0.0624 |
Weighted residual factors for significantly intense reflections | 0.1536 |
Weighted residual factors for all reflections included in the refinement | 0.1617 |
Goodness-of-fit parameter for all reflections included in the refinement | 1.067 |
Diffraction radiation wavelength | 0.71073 Å |
Diffraction radiation type | MoKα |