Information card for entry 7212130
Formula | C37 H27 Cr N Na O14 S24 |
Calculated formula | C37 H27 Cr N Na O14 S24 |
Title of publication | Chiral conducting salts of BEDT-TTF containing a single enantiomer of tris(oxalato)chromate(III) crystallised from a chiral solvent |
Authors of publication | Martin, Lee; Day, Peter; Horton, Peter; Nakatsuji, Shin'ichi; Yamada, Jun'ichi; Akutsu, Hiroki |
Journal of publication | Journal of Materials Chemistry |
Year of publication | 2010 |
Journal volume | 20 |
Journal issue | 14 |
Pages of publication | 2738 |
a | 9.2204 ± 0.0003 Å |
b | 17.0061 ± 0.0006 Å |
c | 35.2109 ± 0.0012 Å |
α | 90° |
β | 90° |
γ | 90° |
Cell volume | 5521.2 ± 0.3 Å3 |
Cell temperature | 120 ± 2 K |
Ambient diffraction temperature | 120 ± 2 K |
Number of distinct elements | 7 |
Space group number | 19 |
Hermann-Mauguin space group symbol | P 21 21 21 |
Hall space group symbol | P 2ac 2ab |
Residual factor for all reflections | 0.0803 |
Residual factor for significantly intense reflections | 0.0635 |
Weighted residual factors for significantly intense reflections | 0.1348 |
Weighted residual factors for all reflections included in the refinement | 0.1425 |
Goodness-of-fit parameter for all reflections included in the refinement | 1.055 |
Diffraction radiation wavelength | 0.71073 Å |
Diffraction radiation type | MoKα |