Information card for entry 7212131
Formula | C37 H27 Cr N Na O14 S24 |
Calculated formula | C37 H27 Cr N Na O14 S24 |
SMILES | [Na+].[Cr]123(OC(=O)C(=O)O1)(OC(=O)C(=O)O2)OC(=O)C(=O)O3.C1CSC2=C(S1)SC(=C1SC3=C(S1)SCCS3)S2.C1CSC2=C(S1)SC(=C1SC3=C(S1)SCCS3)S2.C1CSC2=C(S1)SC(=C1SC3=C(S1)SCCS3)S2.CN(=O)=O |
Title of publication | Chiral conducting salts of BEDT-TTF containing a single enantiomer of tris(oxalato)chromate(III) crystallised from a chiral solvent |
Authors of publication | Martin, Lee; Day, Peter; Horton, Peter; Nakatsuji, Shin'ichi; Yamada, Jun'ichi; Akutsu, Hiroki |
Journal of publication | Journal of Materials Chemistry |
Year of publication | 2010 |
Journal volume | 20 |
Journal issue | 14 |
Pages of publication | 2738 |
a | 10.4406 ± 0.0004 Å |
b | 14.5752 ± 0.0007 Å |
c | 18.1024 ± 0.001 Å |
α | 90° |
β | 94.02 ± 0.003° |
γ | 90° |
Cell volume | 2747.9 ± 0.2 Å3 |
Cell temperature | 120 ± 2 K |
Ambient diffraction temperature | 120 ± 2 K |
Number of distinct elements | 7 |
Space group number | 4 |
Hermann-Mauguin space group symbol | P 1 21 1 |
Hall space group symbol | P 2yb |
Residual factor for all reflections | 0.1494 |
Residual factor for significantly intense reflections | 0.0972 |
Weighted residual factors for significantly intense reflections | 0.1898 |
Weighted residual factors for all reflections included in the refinement | 0.2191 |
Goodness-of-fit parameter for all reflections included in the refinement | 1.104 |
Diffraction radiation wavelength | 0.71073 Å |
Diffraction radiation type | MoKα |