Information card for entry 7212429
Formula | C74 H68 Ag6 La4 N16 O50 |
Calculated formula | C74 H68 Ag6 La4 N16 O50 |
Title of publication | Novel three-dimensional Ln‒Ag 4d‒4f heteropentametallic helix-based microporous metal‒organic framework with unprecedented (3,4,5,6)-connected topology constructed from isonicotinate ligand |
Authors of publication | Li, Zhao-Yang; Dai, Jing-Wei; Yue, Shan-Tang; Liu, Ying-Liang |
Journal of publication | CrystEngComm |
Year of publication | 2010 |
Journal volume | 12 |
Journal issue | 7 |
Pages of publication | 2014 |
a | 17.116 ± 0.0008 Å |
b | 33.9351 ± 0.0016 Å |
c | 8.3694 ± 0.0004 Å |
α | 90° |
β | 95.924 ± 0.001° |
γ | 90° |
Cell volume | 4835.3 ± 0.4 Å3 |
Cell temperature | 298 ± 2 K |
Ambient diffraction temperature | 298 ± 2 K |
Number of distinct elements | 6 |
Space group number | 14 |
Hermann-Mauguin space group symbol | P 1 21/c 1 |
Hall space group symbol | -P 2ybc |
Residual factor for all reflections | 0.0554 |
Residual factor for significantly intense reflections | 0.0366 |
Weighted residual factors for significantly intense reflections | 0.0717 |
Weighted residual factors for all reflections included in the refinement | 0.0794 |
Goodness-of-fit parameter for all reflections included in the refinement | 1.042 |
Diffraction radiation wavelength | 0.71073 Å |
Diffraction radiation type | MoKα |