Information card for entry 7212430
Formula | C41 H30 |
Calculated formula | C41 H30 |
SMILES | C1(=CC(c2c1cccc2)(C)C)c1ccc(cc1)c1c2ccccc2c(c2ccccc12)c1cccc2c1cccc2 |
Title of publication | Robust and highly efficient blue light-emitting hosts based on indene-substituted anthracene |
Authors of publication | Xia, Zhen-Yuan; Zhang, Zhi-Yun; Su, Jian-Hua; Zhang, Qiong; Fung, Ka-Man; Lam, Mei-Ki; Li, King-Fai; Wong, Wai-Yeung; Cheah, Kok-Wai; Tian, He; Chen, Chin H. |
Journal of publication | Journal of Materials Chemistry |
Year of publication | 2010 |
Journal volume | 20 |
Journal issue | 18 |
Pages of publication | 3768 |
a | 40.541 ± 0.006 Å |
b | 7.3556 ± 0.0011 Å |
c | 23.412 ± 0.003 Å |
α | 90° |
β | 123.363 ± 0.002° |
γ | 90° |
Cell volume | 5831 ± 1.4 Å3 |
Cell temperature | 293 ± 2 K |
Ambient diffraction temperature | 293 ± 2 K |
Number of distinct elements | 2 |
Space group number | 15 |
Hermann-Mauguin space group symbol | C 1 2/c 1 |
Hall space group symbol | -C 2yc |
Residual factor for all reflections | 0.1037 |
Residual factor for significantly intense reflections | 0.0526 |
Weighted residual factors for significantly intense reflections | 0.1312 |
Weighted residual factors for all reflections included in the refinement | 0.1554 |
Goodness-of-fit parameter for all reflections included in the refinement | 1.025 |
Diffraction radiation wavelength | 0.71073 Å |
Diffraction radiation type | MoKα |