Information card for entry 7212935
Formula | C28 H21 N O4 Pt |
Calculated formula | C28 H21 N O4 Pt |
SMILES | [Pt]12(c3cc(ccc3c3cccc[n]23)C(=O)C(=O)c2cccc3ccccc23)OC(=CC(=[O]1)C)C |
Title of publication | Tuning the emission properties of cyclometalated platinum(II) complexes by intramolecular electron-sink/arylethynylated ligands and its application for enhanced luminescent oxygen sensing |
Authors of publication | Wu, Wanhua; Wu, Wenting; Ji, Shaomin; Guo, Huimin; Song, Peng; Han, Keli; Chi, Lina; Shao, Jingyin; Zhao, Jianzhang |
Journal of publication | Journal of Materials Chemistry |
Year of publication | 2010 |
Journal volume | 20 |
Journal issue | 43 |
Pages of publication | 9775 |
a | 8.36 ± 0.002 Å |
b | 15.485 ± 0.004 Å |
c | 17.982 ± 0.005 Å |
α | 80.497 ± 0.006° |
β | 89.859 ± 0.005° |
γ | 82.756 ± 0.006° |
Cell volume | 2277.2 ± 1 Å3 |
Cell temperature | 273 ± 2 K |
Ambient diffraction temperature | 273 ± 2 K |
Number of distinct elements | 5 |
Space group number | 2 |
Hermann-Mauguin space group symbol | P -1 |
Hall space group symbol | -P 1 |
Residual factor for all reflections | 0.1397 |
Residual factor for significantly intense reflections | 0.0638 |
Weighted residual factors for significantly intense reflections | 0.0916 |
Weighted residual factors for all reflections included in the refinement | 0.1065 |
Goodness-of-fit parameter for all reflections included in the refinement | 0.923 |
Diffraction radiation wavelength | 0.71073 Å |
Diffraction radiation type | MoKα |