Information card for entry 7212936
Formula | C34 H28 N2 O4 Pt |
Calculated formula | C34 H28 N2 O4 Pt |
Title of publication | Tuning the emission properties of cyclometalated platinum(II) complexes by intramolecular electron-sink/arylethynylated ligands and its application for enhanced luminescent oxygen sensing |
Authors of publication | Wu, Wanhua; Wu, Wenting; Ji, Shaomin; Guo, Huimin; Song, Peng; Han, Keli; Chi, Lina; Shao, Jingyin; Zhao, Jianzhang |
Journal of publication | Journal of Materials Chemistry |
Year of publication | 2010 |
Journal volume | 20 |
Journal issue | 43 |
Pages of publication | 9775 |
a | 27.941 ± 0.016 Å |
b | 5.004 ± 0.003 Å |
c | 41.56 ± 0.02 Å |
α | 90° |
β | 102.511 ± 0.006° |
γ | 90° |
Cell volume | 5673 ± 5 Å3 |
Cell temperature | 273 ± 2 K |
Ambient diffraction temperature | 273 ± 2 K |
Number of distinct elements | 5 |
Space group number | 15 |
Hermann-Mauguin space group symbol | C 1 2/c 1 |
Hall space group symbol | -C 2yc |
Residual factor for all reflections | 0.1267 |
Residual factor for significantly intense reflections | 0.0798 |
Weighted residual factors for significantly intense reflections | 0.1683 |
Weighted residual factors for all reflections included in the refinement | 0.1827 |
Goodness-of-fit parameter for all reflections included in the refinement | 1.046 |
Diffraction radiation wavelength | 0.71073 Å |
Diffraction radiation type | MoKα |