Information card for entry 7214401
Formula | C33 H34 N6 O14 Zn2 |
Calculated formula | C33 H34 N6 O14 Zn2 |
Title of publication | Syntheses, characterization, and properties of five coordination compounds based on the ligand tetrakis(4-pyridyloxymethylene)methane |
Authors of publication | Ju, Zemin; Cao, Dapeng; Qin, Ling; Zhang, Chuanlei; Zhang, Mingdao; Shi, Zhiqiang; Zheng, Hegen |
Journal of publication | CrystEngComm |
Year of publication | 2014 |
Journal volume | 16 |
Journal issue | 19 |
Pages of publication | 3917 |
a | 32.119 ± 0.003 Å |
b | 12.8479 ± 0.001 Å |
c | 20.8244 ± 0.0016 Å |
α | 90° |
β | 90° |
γ | 90° |
Cell volume | 8593.4 ± 1.2 Å3 |
Cell temperature | 291 ± 2 K |
Ambient diffraction temperature | 291 ± 2 K |
Number of distinct elements | 5 |
Space group number | 72 |
Hermann-Mauguin space group symbol | I b a m |
Hall space group symbol | -I 2 2c |
Residual factor for all reflections | 0.0612 |
Residual factor for significantly intense reflections | 0.056 |
Weighted residual factors for significantly intense reflections | 0.1495 |
Weighted residual factors for all reflections included in the refinement | 0.1509 |
Goodness-of-fit parameter for all reflections included in the refinement | 1.063 |
Diffraction radiation wavelength | 0.71073 Å |
Diffraction radiation type | MoKα |