Information card for entry 7214402
Formula | C29 H32 N4 Ni O12 |
Calculated formula | C29 H32 N4 Ni O12 |
Title of publication | Syntheses, characterization, and properties of five coordination compounds based on the ligand tetrakis(4-pyridyloxymethylene)methane |
Authors of publication | Ju, Zemin; Cao, Dapeng; Qin, Ling; Zhang, Chuanlei; Zhang, Mingdao; Shi, Zhiqiang; Zheng, Hegen |
Journal of publication | CrystEngComm |
Year of publication | 2014 |
Journal volume | 16 |
Journal issue | 19 |
Pages of publication | 3917 |
a | 17.334 ± 0.002 Å |
b | 9.2474 ± 0.001 Å |
c | 20.562 ± 0.002 Å |
α | 90° |
β | 108.815 ± 0.004° |
γ | 90° |
Cell volume | 3119.9 ± 0.6 Å3 |
Cell temperature | 291 ± 2 K |
Ambient diffraction temperature | 291 ± 2 K |
Number of distinct elements | 5 |
Space group number | 15 |
Hermann-Mauguin space group symbol | C 1 2/c 1 |
Hall space group symbol | -C 2yc |
Residual factor for all reflections | 0.0453 |
Residual factor for significantly intense reflections | 0.0427 |
Weighted residual factors for significantly intense reflections | 0.1205 |
Weighted residual factors for all reflections included in the refinement | 0.1221 |
Goodness-of-fit parameter for all reflections included in the refinement | 1.123 |
Diffraction radiation wavelength | 0.71073 Å |
Diffraction radiation type | MoKα |