Information card for entry 7215094
Formula | C54 H43 Eu4 N2 O32 |
Calculated formula | C54 H43 Eu4 N2 O32 |
Title of publication | Highly luminescent and thermostable lanthanide-carboxylate framework materials with helical configurations |
Authors of publication | Zhang, Huabin; Zhou, Liujiang; Wei, Jing; Li, Zhihua; Lin, Ping; Du, Shaowu |
Journal of publication | Journal of Materials Chemistry |
Year of publication | 2012 |
Journal volume | 22 |
Journal issue | 39 |
Pages of publication | 21210 |
a | 10.849 ± 0.003 Å |
b | 14.172 ± 0.005 Å |
c | 20.208 ± 0.007 Å |
α | 86.734 ± 0.007° |
β | 83.852 ± 0.009° |
γ | 79.093 ± 0.007° |
Cell volume | 3031.2 ± 1.7 Å3 |
Cell temperature | 293 ± 2 K |
Ambient diffraction temperature | 293 ± 2 K |
Number of distinct elements | 5 |
Space group number | 2 |
Hermann-Mauguin space group symbol | P -1 |
Hall space group symbol | -P 1 |
Residual factor for all reflections | 0.0435 |
Residual factor for significantly intense reflections | 0.0381 |
Weighted residual factors for significantly intense reflections | 0.08 |
Weighted residual factors for all reflections included in the refinement | 0.082 |
Goodness-of-fit parameter for all reflections included in the refinement | 0.994 |
Diffraction radiation wavelength | 0.71073 Å |
Diffraction radiation type | MoKα |