Information card for entry 7215095
Formula | C54 H40 Gd4 N2 O32 |
Calculated formula | C54 H40 Gd4 N2 O32 |
Title of publication | Highly luminescent and thermostable lanthanide-carboxylate framework materials with helical configurations |
Authors of publication | Zhang, Huabin; Zhou, Liujiang; Wei, Jing; Li, Zhihua; Lin, Ping; Du, Shaowu |
Journal of publication | Journal of Materials Chemistry |
Year of publication | 2012 |
Journal volume | 22 |
Journal issue | 39 |
Pages of publication | 21210 |
a | 10.836 ± 0.003 Å |
b | 14.156 ± 0.004 Å |
c | 20.139 ± 0.005 Å |
α | 86.706 ± 0.007° |
β | 83.875 ± 0.007° |
γ | 78.99 ± 0.004° |
Cell volume | 3012.9 ± 1.4 Å3 |
Cell temperature | 293 ± 2 K |
Ambient diffraction temperature | 293 ± 2 K |
Number of distinct elements | 5 |
Space group number | 2 |
Hermann-Mauguin space group symbol | P -1 |
Hall space group symbol | -P 1 |
Residual factor for all reflections | 0.0392 |
Residual factor for significantly intense reflections | 0.0339 |
Weighted residual factors for significantly intense reflections | 0.0834 |
Weighted residual factors for all reflections included in the refinement | 0.0887 |
Goodness-of-fit parameter for all reflections included in the refinement | 0.98 |
Diffraction radiation wavelength | 0.71073 Å |
Diffraction radiation type | MoKα |