Information card for entry 7217171
Formula | C29 H33 Cu2 N5 O14 |
Calculated formula | C29 H33 Cu2 N5 O14 |
Title of publication | CuII‒PDC-bpe frameworks (PDC = 2,5-pyridinedicarboxylate, bpe = 1,2-di(4-pyridyl)ethylene): mapping of herringbone-type structures |
Authors of publication | Llano-Tomé, Francisco; Bazán, Begoña; Urtiaga, Miren-Karmele; Barandika, Gotzone; Lezama, Luis; Arriortua, María-Isabel |
Journal of publication | CrystEngComm |
Year of publication | 2014 |
Journal volume | 16 |
Journal issue | 37 |
Pages of publication | 8726 |
a | 11.4682 ± 0.0002 Å |
b | 8.8977 ± 0.0001 Å |
c | 15.6872 ± 0.0002 Å |
α | 90° |
β | 94.074 ± 0.001° |
γ | 90° |
Cell volume | 1596.69 ± 0.04 Å3 |
Cell temperature | 100 ± 2 K |
Ambient diffraction temperature | 100 ± 2 K |
Number of distinct elements | 5 |
Space group number | 7 |
Hermann-Mauguin space group symbol | P 1 n 1 |
Hall space group symbol | P -2yac |
Residual factor for all reflections | 0.0317 |
Residual factor for significantly intense reflections | 0.0296 |
Weighted residual factors for significantly intense reflections | 0.0767 |
Weighted residual factors for all reflections included in the refinement | 0.0782 |
Goodness-of-fit parameter for all reflections included in the refinement | 1.041 |
Diffraction radiation wavelength | 1.54184 Å |
Diffraction radiation type | CuKα |