Information card for entry 7217172
Formula | C13 H10 Cu N2 O7 |
Calculated formula | C13 H10 Cu N2 O7 |
Title of publication | CuII‒PDC-bpe frameworks (PDC = 2,5-pyridinedicarboxylate, bpe = 1,2-di(4-pyridyl)ethylene): mapping of herringbone-type structures |
Authors of publication | Llano-Tomé, Francisco; Bazán, Begoña; Urtiaga, Miren-Karmele; Barandika, Gotzone; Lezama, Luis; Arriortua, María-Isabel |
Journal of publication | CrystEngComm |
Year of publication | 2014 |
Journal volume | 16 |
Journal issue | 37 |
Pages of publication | 8726 |
a | 11.3256 ± 0.0003 Å |
b | 8.9352 ± 0.0002 Å |
c | 15.1672 ± 0.0004 Å |
α | 90° |
β | 93.037 ± 0.003° |
γ | 90° |
Cell volume | 1532.71 ± 0.07 Å3 |
Cell temperature | 100 ± 2 K |
Ambient diffraction temperature | 100 ± 2 K |
Number of distinct elements | 5 |
Space group number | 14 |
Hermann-Mauguin space group symbol | P 1 21/n 1 |
Hall space group symbol | -P 2yn |
Residual factor for all reflections | 0.0542 |
Residual factor for significantly intense reflections | 0.0481 |
Weighted residual factors for significantly intense reflections | 0.1372 |
Weighted residual factors for all reflections included in the refinement | 0.1445 |
Goodness-of-fit parameter for all reflections included in the refinement | 1.014 |
Diffraction radiation wavelength | 1.54184 Å |
Diffraction radiation type | CuKα |