Information card for entry 7217803
Formula | C13 H18 Cd N4 O4 |
Calculated formula | C13 H18 Cd N4 O4 |
Title of publication | Mutual transformation between crystalline phases and dielectric properties of coordination polymers with the formula [Cd(N-methylimidazole)2(H2O)x(glutarate)]·nH2O (x = 0 or 1; n = or 4) |
Authors of publication | Xue, Chen; Xu, Heng; Huang, Rong-Yi; Ren, Xiao-Ming |
Journal of publication | CrystEngComm |
Year of publication | 2014 |
Journal volume | 16 |
Journal issue | 42 |
Pages of publication | 9857 |
a | 8.9979 ± 0.0009 Å |
b | 14.5904 ± 0.0014 Å |
c | 13.4092 ± 0.0013 Å |
α | 90° |
β | 113.863 ± 0.006° |
γ | 90° |
Cell volume | 1609.9 ± 0.3 Å3 |
Cell temperature | 296 ± 2 K |
Ambient diffraction temperature | 296 ± 2 K |
Number of distinct elements | 5 |
Space group number | 14 |
Hermann-Mauguin space group symbol | P 1 21/c 1 |
Hall space group symbol | -P 2ybc |
Residual factor for all reflections | 0.0539 |
Residual factor for significantly intense reflections | 0.0466 |
Weighted residual factors for significantly intense reflections | 0.1319 |
Weighted residual factors for all reflections included in the refinement | 0.1379 |
Goodness-of-fit parameter for all reflections included in the refinement | 1.049 |
Diffraction radiation wavelength | 0.71073 Å |
Diffraction radiation type | MoKα |