Information card for entry 7217804
Formula | C13 H28 Cd N4 O9 |
Calculated formula | C13 H28 Cd N4 O9 |
Title of publication | Mutual transformation between crystalline phases and dielectric properties of coordination polymers with the formula [Cd(N-methylimidazole)2(H2O)x(glutarate)]·nH2O (x = 0 or 1; n = or 4) |
Authors of publication | Xue, Chen; Xu, Heng; Huang, Rong-Yi; Ren, Xiao-Ming |
Journal of publication | CrystEngComm |
Year of publication | 2014 |
Journal volume | 16 |
Journal issue | 42 |
Pages of publication | 9857 |
a | 16.9674 ± 0.0017 Å |
b | 14.2074 ± 0.0014 Å |
c | 8.7538 ± 0.0008 Å |
α | 90° |
β | 90° |
γ | 90° |
Cell volume | 2110.2 ± 0.4 Å3 |
Cell temperature | 296 ± 2 K |
Ambient diffraction temperature | 296 ± 2 K |
Number of distinct elements | 5 |
Space group number | 54 |
Hermann-Mauguin space group symbol | P c c a |
Hall space group symbol | -P 2a 2ac |
Residual factor for all reflections | 0.0428 |
Residual factor for significantly intense reflections | 0.0268 |
Weighted residual factors for significantly intense reflections | 0.0617 |
Weighted residual factors for all reflections included in the refinement | 0.068 |
Goodness-of-fit parameter for all reflections included in the refinement | 1.041 |
Diffraction radiation wavelength | 0.71073 Å |
Diffraction radiation type | MoKα |