Information card for entry 7218306
Formula | C28 H32 Cu N4 O7 |
Calculated formula | C28 H30 Cu N4 O7 |
Title of publication | Structural directing roles of isomeric phenylenediacetate ligands in the formation of coordination networks based on flexible N,N′-di(3-pyridyl)suberoamide |
Authors of publication | Lo, Yang-Chih; Hsu, Wayne; He, Hsiu-Yi; Hyde, Stephen T.; Proserpio, Davide M.; Chen, Jhy-Der |
Journal of publication | CrystEngComm |
Year of publication | 2015 |
Journal volume | 17 |
Journal issue | 1 |
Pages of publication | 90 |
a | 8.3326 ± 0.0004 Å |
b | 10.378 ± 0.0005 Å |
c | 16.5929 ± 0.0009 Å |
α | 87.46 ± 0.003° |
β | 77.784 ± 0.003° |
γ | 74.322 ± 0.003° |
Cell volume | 1350.09 ± 0.12 Å3 |
Cell temperature | 296 ± 2 K |
Ambient diffraction temperature | 296 ± 2 K |
Number of distinct elements | 5 |
Space group number | 2 |
Hermann-Mauguin space group symbol | P -1 |
Hall space group symbol | -P 1 |
Residual factor for all reflections | 0.1205 |
Residual factor for significantly intense reflections | 0.0652 |
Weighted residual factors for significantly intense reflections | 0.167 |
Weighted residual factors for all reflections included in the refinement | 0.2012 |
Goodness-of-fit parameter for all reflections included in the refinement | 1.028 |
Diffraction radiation wavelength | 0.71073 Å |
Diffraction radiation type | MoKα |