Information card for entry 7218307
Formula | C28 H34 Cu N4 O8 |
Calculated formula | C28 H34 Cu N4 O8 |
Title of publication | Structural directing roles of isomeric phenylenediacetate ligands in the formation of coordination networks based on flexible N,N′-di(3-pyridyl)suberoamide |
Authors of publication | Lo, Yang-Chih; Hsu, Wayne; He, Hsiu-Yi; Hyde, Stephen T.; Proserpio, Davide M.; Chen, Jhy-Der |
Journal of publication | CrystEngComm |
Year of publication | 2015 |
Journal volume | 17 |
Journal issue | 1 |
Pages of publication | 90 |
a | 29.5458 ± 0.0009 Å |
b | 6.3519 ± 0.0002 Å |
c | 18.5588 ± 0.0006 Å |
α | 90° |
β | 125.32 ± 0.002° |
γ | 90° |
Cell volume | 2841.88 ± 0.17 Å3 |
Cell temperature | 296 ± 2 K |
Ambient diffraction temperature | 296 ± 2 K |
Number of distinct elements | 5 |
Space group number | 15 |
Hermann-Mauguin space group symbol | C 1 2/c 1 |
Hall space group symbol | -C 2yc |
Residual factor for all reflections | 0.1121 |
Residual factor for significantly intense reflections | 0.0624 |
Weighted residual factors for significantly intense reflections | 0.1577 |
Weighted residual factors for all reflections included in the refinement | 0.1864 |
Goodness-of-fit parameter for all reflections included in the refinement | 1.009 |
Diffraction radiation wavelength | 0.71073 Å |
Diffraction radiation type | MoKα |