Information card for entry 7218308
Formula | C28 H34 Cu N4 O8 |
Calculated formula | C28 H34 Cu N4 O8 |
Title of publication | Structural directing roles of isomeric phenylenediacetate ligands in the formation of coordination networks based on flexible N,N′-di(3-pyridyl)suberoamide |
Authors of publication | Lo, Yang-Chih; Hsu, Wayne; He, Hsiu-Yi; Hyde, Stephen T.; Proserpio, Davide M.; Chen, Jhy-Der |
Journal of publication | CrystEngComm |
Year of publication | 2015 |
Journal volume | 17 |
Journal issue | 1 |
Pages of publication | 90 |
a | 15.8723 ± 0.0008 Å |
b | 12.1103 ± 0.0006 Å |
c | 14.8539 ± 0.0007 Å |
α | 90° |
β | 90° |
γ | 90° |
Cell volume | 2855.2 ± 0.2 Å3 |
Cell temperature | 296 ± 2 K |
Ambient diffraction temperature | 296 ± 2 K |
Number of distinct elements | 5 |
Space group number | 53 |
Hermann-Mauguin space group symbol | P m n a |
Hall space group symbol | -P 2ac 2 |
Residual factor for all reflections | 0.1229 |
Residual factor for significantly intense reflections | 0.075 |
Weighted residual factors for significantly intense reflections | 0.1865 |
Weighted residual factors for all reflections included in the refinement | 0.2242 |
Goodness-of-fit parameter for all reflections included in the refinement | 1.053 |
Diffraction radiation wavelength | 0.71073 Å |
Diffraction radiation type | MoKα |