Information card for entry 7219455
Formula | C16 H28 O22 U2 |
Calculated formula | C16 H10 O13 U2 |
Title of publication | A family of 3D UO22±-5-X-1,3-dicarboxylate (X = ‒H, ‒NO2, ‒NH2, ‒OH) hybrid materials: structural relevance with variation of substituent groups and photochemical properties |
Authors of publication | Zhai, Xiang-Sheng; Zhu, Wen-Gang; Xu, Wei; Huang, Ya-Jing; Zheng, Yue-Qing |
Journal of publication | CrystEngComm |
Year of publication | 2015 |
Journal volume | 17 |
Journal issue | 11 |
Pages of publication | 2376 |
a | 9.6655 ± 0.0019 Å |
b | 11.002 ± 0.002 Å |
c | 15.304 ± 0.003 Å |
α | 108.95 ± 0.03° |
β | 95.14 ± 0.03° |
γ | 109.32 ± 0.03° |
Cell volume | 1416.7 ± 0.7 Å3 |
Cell temperature | 295 ± 2 K |
Ambient diffraction temperature | 295 ± 2 K |
Number of distinct elements | 4 |
Space group number | 2 |
Hermann-Mauguin space group symbol | P -1 |
Hall space group symbol | -P 1 |
Residual factor for all reflections | 0.0775 |
Residual factor for significantly intense reflections | 0.0521 |
Weighted residual factors for significantly intense reflections | 0.1405 |
Weighted residual factors for all reflections included in the refinement | 0.1778 |
Goodness-of-fit parameter for all reflections included in the refinement | 1.108 |
Diffraction radiation wavelength | 0.71073 Å |
Diffraction radiation type | MoKα |