Information card for entry 7219456
Formula | C22 H26 N3 O18 U2 |
Calculated formula | C22 H26 N3 O18 U2 |
Title of publication | A family of 3D UO22±-5-X-1,3-dicarboxylate (X = ‒H, ‒NO2, ‒NH2, ‒OH) hybrid materials: structural relevance with variation of substituent groups and photochemical properties |
Authors of publication | Zhai, Xiang-Sheng; Zhu, Wen-Gang; Xu, Wei; Huang, Ya-Jing; Zheng, Yue-Qing |
Journal of publication | CrystEngComm |
Year of publication | 2015 |
Journal volume | 17 |
Journal issue | 11 |
Pages of publication | 2376 |
a | 10.663 ± 0.002 Å |
b | 11.09 ± 0.002 Å |
c | 14.718 ± 0.003 Å |
α | 106.88 ± 0.03° |
β | 95.76 ± 0.03° |
γ | 112.99 ± 0.03° |
Cell volume | 1487.3 ± 0.8 Å3 |
Cell temperature | 295 ± 2 K |
Ambient diffraction temperature | 295 ± 2 K |
Number of distinct elements | 5 |
Space group number | 2 |
Hermann-Mauguin space group symbol | P -1 |
Hall space group symbol | -P 1 |
Residual factor for all reflections | 0.0461 |
Residual factor for significantly intense reflections | 0.0379 |
Weighted residual factors for significantly intense reflections | 0.0934 |
Weighted residual factors for all reflections included in the refinement | 0.0988 |
Goodness-of-fit parameter for all reflections included in the refinement | 1.073 |
Diffraction radiation wavelength | 0.71073 Å |
Diffraction radiation type | MoKα |