Information card for entry 7220000
Formula | C40 H36 Ag Dy2 N3 O21 |
Calculated formula | C40 H36 Ag Dy2 N3 O21 |
Title of publication | Two series of Ln(iii)‒Ag(i) heterometallic‒organic frameworks constructed from isonicotinate and 2,2′-biphenyldicarboxylate: synthesis, structure and photoluminescence properties |
Authors of publication | Lin, Xiao-Ming; Ding, Yu-Jia; Liang, Shui-Mei; Ge, Si-Xiao; Wei, Lei-Ming; Xie, Ji-Qing; Zhang, Gang; Cai, Yue-Peng |
Journal of publication | CrystEngComm |
Year of publication | 2015 |
Journal volume | 17 |
Journal issue | 20 |
Pages of publication | 3800 |
a | 23.4208 ± 0.0018 Å |
b | 8.7474 ± 0.0007 Å |
c | 24.1695 ± 0.0019 Å |
α | 90° |
β | 102.525 ± 0.001° |
γ | 90° |
Cell volume | 4833.8 ± 0.7 Å3 |
Cell temperature | 293 ± 2 K |
Ambient diffraction temperature | 293 ± 2 K |
Number of distinct elements | 6 |
Space group number | 15 |
Hermann-Mauguin space group symbol | C 1 2/c 1 |
Hall space group symbol | -C 2yc |
Residual factor for all reflections | 0.0648 |
Residual factor for significantly intense reflections | 0.0544 |
Weighted residual factors for significantly intense reflections | 0.1713 |
Weighted residual factors for all reflections included in the refinement | 0.1799 |
Goodness-of-fit parameter for all reflections included in the refinement | 1.094 |
Diffraction radiation wavelength | 0.71073 Å |
Diffraction radiation type | MoKα |