Information card for entry 7220001
Formula | C40 H36 Ag N3 O21 Tb2 |
Calculated formula | C40 H36 Ag N3 O21 Tb2 |
Title of publication | Two series of Ln(iii)‒Ag(i) heterometallic‒organic frameworks constructed from isonicotinate and 2,2′-biphenyldicarboxylate: synthesis, structure and photoluminescence properties |
Authors of publication | Lin, Xiao-Ming; Ding, Yu-Jia; Liang, Shui-Mei; Ge, Si-Xiao; Wei, Lei-Ming; Xie, Ji-Qing; Zhang, Gang; Cai, Yue-Peng |
Journal of publication | CrystEngComm |
Year of publication | 2015 |
Journal volume | 17 |
Journal issue | 20 |
Pages of publication | 3800 |
a | 23.738 ± 0.005 Å |
b | 8.74 ± 0.002 Å |
c | 23.966 ± 0.005 Å |
α | 90° |
β | 102.618 ± 0.003° |
γ | 90° |
Cell volume | 4852.1 ± 1.8 Å3 |
Cell temperature | 293 ± 2 K |
Ambient diffraction temperature | 293 ± 2 K |
Number of distinct elements | 6 |
Space group number | 15 |
Hermann-Mauguin space group symbol | C 1 2/c 1 |
Hall space group symbol | -C 2yc |
Residual factor for all reflections | 0.0698 |
Residual factor for significantly intense reflections | 0.0531 |
Weighted residual factors for significantly intense reflections | 0.1625 |
Weighted residual factors for all reflections included in the refinement | 0.1782 |
Goodness-of-fit parameter for all reflections included in the refinement | 1.009 |
Diffraction radiation wavelength | 0.71073 Å |
Diffraction radiation type | MoKα |