Information card for entry 7220014
Formula | C78 H52 Cd3 N4 O18 |
Calculated formula | C78 H40 Cd3 N4 O18 |
Title of publication | A family of coordination polymers assembled with a flexible hexacarboxylate ligand and auxiliary N-donor ligands: syntheses, structures, and physical properties |
Authors of publication | Zhang, Hong-Mei; Yang, Jin; Liu, Ying-Ying; Kang, Da-Wei; Ma, Jian-Fang |
Journal of publication | CrystEngComm |
Year of publication | 2015 |
Journal volume | 17 |
Journal issue | 16 |
Pages of publication | 3181 |
a | 11.427 ± 0.0009 Å |
b | 12.165 ± 0.001 Å |
c | 13.217 ± 0.001 Å |
α | 100.658 ± 0.007° |
β | 107.125 ± 0.007° |
γ | 98.125 ± 0.006° |
Cell volume | 1687.6 ± 0.3 Å3 |
Cell temperature | 293 ± 2 K |
Ambient diffraction temperature | 293 ± 2 K |
Number of distinct elements | 5 |
Space group number | 2 |
Hermann-Mauguin space group symbol | P -1 |
Hall space group symbol | -P 1 |
Residual factor for all reflections | 0.0831 |
Residual factor for significantly intense reflections | 0.0577 |
Weighted residual factors for significantly intense reflections | 0.1371 |
Weighted residual factors for all reflections included in the refinement | 0.1596 |
Goodness-of-fit parameter for all reflections included in the refinement | 1.03 |
Diffraction radiation wavelength | 0.71069 Å |
Diffraction radiation type | MoKα |