Information card for entry 7220015
Formula | C79 H58 Co2 N4 Na O19.5 |
Calculated formula | C79 H53 Co2 N4 Na O19.5 |
Title of publication | A family of coordination polymers assembled with a flexible hexacarboxylate ligand and auxiliary N-donor ligands: syntheses, structures, and physical properties |
Authors of publication | Zhang, Hong-Mei; Yang, Jin; Liu, Ying-Ying; Kang, Da-Wei; Ma, Jian-Fang |
Journal of publication | CrystEngComm |
Year of publication | 2015 |
Journal volume | 17 |
Journal issue | 16 |
Pages of publication | 3181 |
a | 14.37 ± 0.0012 Å |
b | 28.431 ± 0.002 Å |
c | 17.883 ± 0.002 Å |
α | 90° |
β | 100.673 ± 0.005° |
γ | 90° |
Cell volume | 7179.8 ± 1.1 Å3 |
Cell temperature | 293 ± 2 K |
Ambient diffraction temperature | 293 ± 2 K |
Number of distinct elements | 6 |
Space group number | 14 |
Hermann-Mauguin space group symbol | P 1 21/n 1 |
Hall space group symbol | -P 2yn |
Residual factor for all reflections | 0.1142 |
Residual factor for significantly intense reflections | 0.0613 |
Weighted residual factors for significantly intense reflections | 0.1348 |
Weighted residual factors for all reflections included in the refinement | 0.1598 |
Goodness-of-fit parameter for all reflections included in the refinement | 1.029 |
Diffraction radiation wavelength | 0.71069 Å |
Diffraction radiation type | MoKα |