Information card for entry 7220017
Formula | C94 H71 Cu2 N8 O18.5 |
Calculated formula | C94 H70 Cu2 N8 O18.5 |
Title of publication | A family of coordination polymers assembled with a flexible hexacarboxylate ligand and auxiliary N-donor ligands: syntheses, structures, and physical properties |
Authors of publication | Zhang, Hong-Mei; Yang, Jin; Liu, Ying-Ying; Kang, Da-Wei; Ma, Jian-Fang |
Journal of publication | CrystEngComm |
Year of publication | 2015 |
Journal volume | 17 |
Journal issue | 16 |
Pages of publication | 3181 |
a | 32.986 ± 0.0017 Å |
b | 17.323 ± 0.0015 Å |
c | 28.382 ± 0.0017 Å |
α | 90° |
β | 148.758 ± 0.014° |
γ | 90° |
Cell volume | 8411 ± 4 Å3 |
Cell temperature | 293 ± 2 K |
Ambient diffraction temperature | 293 ± 2 K |
Number of distinct elements | 5 |
Space group number | 15 |
Hermann-Mauguin space group symbol | C 1 2/c 1 |
Hall space group symbol | -C 2yc |
Residual factor for all reflections | 0.3418 |
Residual factor for significantly intense reflections | 0.1593 |
Weighted residual factors for significantly intense reflections | 0.2424 |
Weighted residual factors for all reflections included in the refinement | 0.2919 |
Goodness-of-fit parameter for all reflections included in the refinement | 1.2 |
Diffraction radiation wavelength | 0.71069 Å |
Diffraction radiation type | MoKα |