Information card for entry 7220016
Formula | C64 H44 Co3 N2 O18 |
Calculated formula | C64 H44 Co3 N2 O18 |
Title of publication | A family of coordination polymers assembled with a flexible hexacarboxylate ligand and auxiliary N-donor ligands: syntheses, structures, and physical properties |
Authors of publication | Zhang, Hong-Mei; Yang, Jin; Liu, Ying-Ying; Kang, Da-Wei; Ma, Jian-Fang |
Journal of publication | CrystEngComm |
Year of publication | 2015 |
Journal volume | 17 |
Journal issue | 16 |
Pages of publication | 3181 |
a | 10.672 ± 0.0007 Å |
b | 12.394 ± 0.0007 Å |
c | 12.501 ± 0.0007 Å |
α | 75.378 ± 0.005° |
β | 73.453 ± 0.005° |
γ | 87.968 ± 0.005° |
Cell volume | 1532.5 ± 0.17 Å3 |
Cell temperature | 293 ± 2 K |
Ambient diffraction temperature | 293 ± 2 K |
Number of distinct elements | 5 |
Space group number | 2 |
Hermann-Mauguin space group symbol | P -1 |
Hall space group symbol | -P 1 |
Residual factor for all reflections | 0.1035 |
Residual factor for significantly intense reflections | 0.0607 |
Weighted residual factors for significantly intense reflections | 0.1392 |
Weighted residual factors for all reflections included in the refinement | 0.1673 |
Goodness-of-fit parameter for all reflections included in the refinement | 1.018 |
Diffraction radiation wavelength | 0.71069 Å |
Diffraction radiation type | MoKα |