Information card for entry 7220252
Formula |
C26 H20 Mn N2 O6 |
Calculated formula |
C26 H20 Mn N2 O6 |
Title of publication |
Isolation of first row transition metal‒carboxylate zwitterions |
Authors of publication |
Armaghan, Mahsa; Lu, Wei-Yu; Wu, Di; Wei, Yao; Yuan, Feng-Ling; Weng, Ng Seik; MOHHAMADPOUR AMINI, MOSTAFA; Zhang, Wen-Hua; Young, David James; Hor, Andy; Lang, Jian-Ping |
Journal of publication |
RSC Adv. |
Year of publication |
2015 |
a |
9.904 ± 0.002 Å |
b |
10.165 ± 0.002 Å |
c |
12.286 ± 0.003 Å |
α |
77.47 ± 0.003° |
β |
68.167 ± 0.003° |
γ |
85.302 ± 0.003° |
Cell volume |
1120.8 ± 0.4 Å3 |
Cell temperature |
153 ± 2 K |
Ambient diffraction temperature |
153 ± 2 K |
Number of distinct elements |
5 |
Space group number |
2 |
Hermann-Mauguin space group symbol |
P -1 |
Hall space group symbol |
-P 1 |
Residual factor for all reflections |
0.0658 |
Residual factor for significantly intense reflections |
0.041 |
Weighted residual factors for significantly intense reflections |
0.0962 |
Weighted residual factors for all reflections included in the refinement |
0.1069 |
Goodness-of-fit parameter for all reflections included in the refinement |
1.017 |
Diffraction radiation wavelength |
0.71073 Å |
Diffraction radiation type |
MoKα |
Yes |
No |
No |