Information card for entry 7220253
Chemical name | [Co(tdzdc)(4,4?-bipy)(H2O)]n |
Formula | C14 H10 Co N4 O5 S |
Calculated formula | C14 H10 Co N4 O5 S |
Title of publication | Topological modulation of metal‒thiadiazole dicarboxylate coordination polymers through auxiliary ligand alteration |
Authors of publication | Zhao, Zhen-Xin; Li, Yun-Wu; Liu, Sui-Jun; Wang, Li-Fu; Chang, Ze; Xu, Jian; Zhang, Ying-Hui |
Journal of publication | CrystEngComm |
Year of publication | 2015 |
Journal volume | 17 |
Journal issue | 23 |
Pages of publication | 4301 |
a | 11.455 ± 0.002 Å |
b | 8.5195 ± 0.0017 Å |
c | 16.698 ± 0.003 Å |
α | 90° |
β | 103.81 ± 0.03° |
γ | 90° |
Cell volume | 1582.5 ± 0.5 Å3 |
Cell temperature | 293 ± 2 K |
Ambient diffraction temperature | 293 ± 2 K |
Number of distinct elements | 6 |
Space group number | 14 |
Hermann-Mauguin space group symbol | P 1 21/n 1 |
Hall space group symbol | -P 2yn |
Residual factor for all reflections | 0.0418 |
Residual factor for significantly intense reflections | 0.0374 |
Weighted residual factors for significantly intense reflections | 0.082 |
Weighted residual factors for all reflections included in the refinement | 0.084 |
Goodness-of-fit parameter for all reflections included in the refinement | 1.091 |
Diffraction radiation wavelength | 0.71073 Å |
Diffraction radiation type | MoKα |