Information card for entry 7220288
Formula | C44 H29 Cd2 N4 O8.5 |
Calculated formula | C44 H28 Cd2 N4 O8.5 |
Title of publication | Syntheses, structures, magnetic and luminescence properties of a series of coordination polymers constructed from 1,4-naphthalenedicarboxylate and N-donor ligands |
Authors of publication | Yang, Liu; Qin, Chao; Song, Bai-Qiao; Li, Xiao; Wang, Chun-Gang; Su, Zhong-Min |
Journal of publication | CrystEngComm |
Year of publication | 2015 |
Journal volume | 17 |
Journal issue | 24 |
Pages of publication | 4517 |
a | 11.057 ± 0.005 Å |
b | 12.6 ± 0.005 Å |
c | 13.982 ± 0.005 Å |
α | 82.66 ± 0.005° |
β | 84.841 ± 0.005° |
γ | 82.541 ± 0.005° |
Cell volume | 1910.3 ± 1.3 Å3 |
Cell temperature | 293 ± 2 K |
Ambient diffraction temperature | 293 ± 2 K |
Number of distinct elements | 5 |
Space group number | 2 |
Hermann-Mauguin space group symbol | P -1 |
Hall space group symbol | -P 1 |
Residual factor for all reflections | 0.0538 |
Residual factor for significantly intense reflections | 0.0357 |
Weighted residual factors for significantly intense reflections | 0.0845 |
Weighted residual factors for all reflections included in the refinement | 0.093 |
Goodness-of-fit parameter for all reflections included in the refinement | 1.029 |
Diffraction radiation wavelength | 0.71069 Å |
Diffraction radiation type | MoKα |