Information card for entry 7220289
Formula | C24 H15 Cd N2 O4.5 |
Calculated formula | C24 H14 Cd N2 O4.5 |
Title of publication | Syntheses, structures, magnetic and luminescence properties of a series of coordination polymers constructed from 1,4-naphthalenedicarboxylate and N-donor ligands |
Authors of publication | Yang, Liu; Qin, Chao; Song, Bai-Qiao; Li, Xiao; Wang, Chun-Gang; Su, Zhong-Min |
Journal of publication | CrystEngComm |
Year of publication | 2015 |
Journal volume | 17 |
Journal issue | 24 |
Pages of publication | 4517 |
a | 11.561 ± 0.005 Å |
b | 14.705 ± 0.005 Å |
c | 11.867 ± 0.005 Å |
α | 90° |
β | 95.169 ± 0.005° |
γ | 90° |
Cell volume | 2009.2 ± 1.4 Å3 |
Cell temperature | 293 ± 2 K |
Ambient diffraction temperature | 293 ± 2 K |
Number of distinct elements | 5 |
Space group number | 14 |
Hermann-Mauguin space group symbol | P 1 21/n 1 |
Hall space group symbol | -P 2yn |
Residual factor for all reflections | 0.0447 |
Residual factor for significantly intense reflections | 0.0294 |
Weighted residual factors for significantly intense reflections | 0.066 |
Weighted residual factors for all reflections included in the refinement | 0.0717 |
Goodness-of-fit parameter for all reflections included in the refinement | 1.027 |
Diffraction radiation wavelength | 0.71069 Å |
Diffraction radiation type | MoKα |