Information card for entry 7220291
Formula | C72 H66 Co3 N8 O18 |
Calculated formula | C72 H66 Co3 N8 O18 |
Title of publication | Syntheses, structures, magnetic and luminescence properties of a series of coordination polymers constructed from 1,4-naphthalenedicarboxylate and N-donor ligands |
Authors of publication | Yang, Liu; Qin, Chao; Song, Bai-Qiao; Li, Xiao; Wang, Chun-Gang; Su, Zhong-Min |
Journal of publication | CrystEngComm |
Year of publication | 2015 |
Journal volume | 17 |
Journal issue | 24 |
Pages of publication | 4517 |
a | 15.481 ± 0.005 Å |
b | 15.415 ± 0.005 Å |
c | 15.994 ± 0.005 Å |
α | 90° |
β | 118.221 ± 0.005° |
γ | 90° |
Cell volume | 3363.1 ± 1.9 Å3 |
Cell temperature | 293 ± 2 K |
Ambient diffraction temperature | 293 ± 2 K |
Number of distinct elements | 5 |
Space group number | 14 |
Hermann-Mauguin space group symbol | P 1 21/n 1 |
Hall space group symbol | -P 2yn |
Residual factor for all reflections | 0.063 |
Residual factor for significantly intense reflections | 0.0439 |
Weighted residual factors for significantly intense reflections | 0.1071 |
Weighted residual factors for all reflections included in the refinement | 0.1172 |
Goodness-of-fit parameter for all reflections included in the refinement | 1.02 |
Diffraction radiation wavelength | 0.71069 Å |
Diffraction radiation type | MoKα |