Information card for entry 7220292
Formula | C48 H36 Cd2 N10 O11 |
Calculated formula | C48 H34.5 Cd2 N10 O11 |
Title of publication | Syntheses, structures, magnetic and luminescence properties of a series of coordination polymers constructed from 1,4-naphthalenedicarboxylate and N-donor ligands |
Authors of publication | Yang, Liu; Qin, Chao; Song, Bai-Qiao; Li, Xiao; Wang, Chun-Gang; Su, Zhong-Min |
Journal of publication | CrystEngComm |
Year of publication | 2015 |
Journal volume | 17 |
Journal issue | 24 |
Pages of publication | 4517 |
a | 9.7473 ± 0.0019 Å |
b | 15.238 ± 0.003 Å |
c | 30.16 ± 0.006 Å |
α | 90° |
β | 93.463 ± 0.003° |
γ | 90° |
Cell volume | 4471.5 ± 1.5 Å3 |
Cell temperature | 293 ± 2 K |
Ambient diffraction temperature | 293 ± 2 K |
Number of distinct elements | 5 |
Space group number | 14 |
Hermann-Mauguin space group symbol | P 1 21/c 1 |
Hall space group symbol | -P 2ybc |
Residual factor for all reflections | 0.1349 |
Residual factor for significantly intense reflections | 0.0821 |
Weighted residual factors for significantly intense reflections | 0.2085 |
Weighted residual factors for all reflections included in the refinement | 0.2446 |
Goodness-of-fit parameter for all reflections included in the refinement | 1.018 |
Diffraction radiation wavelength | 0.71073 Å |
Diffraction radiation type | MoKα |