Information card for entry 7220324
Formula | C24 H10 O14 Zn2.5 |
Calculated formula | C24 H10 O14 Zn2.5 |
Title of publication | Structural variability, unusual thermochromic luminescence and nitrobenzene sensing properties of five Zn(ii) coordination polymers assembled from a terphenyl-hexacarboxylate ligand |
Authors of publication | Wan, Xiu-Yan; Jiang, Fei-Long; Chen, Lian; Pan, Jie; Zhou, Kang; Su, Kong-Zhao; Pang, Jian-Dong; Lyu, Guang-Xun; Hong, Mao-Chun |
Journal of publication | CrystEngComm |
Year of publication | 2015 |
Journal volume | 17 |
Journal issue | 20 |
Pages of publication | 3829 |
a | 9.3789 ± 0.0003 Å |
b | 10.9247 ± 0.0004 Å |
c | 18.8993 ± 0.0006 Å |
α | 104.858 ± 0.003° |
β | 94.314 ± 0.002° |
γ | 107.714 ± 0.003° |
Cell volume | 1758.1 ± 0.11 Å3 |
Cell temperature | 100 ± 2 K |
Ambient diffraction temperature | 100 ± 2 K |
Number of distinct elements | 4 |
Space group number | 2 |
Hermann-Mauguin space group symbol | P -1 |
Hall space group symbol | -P 1 |
Residual factor for all reflections | 0.0508 |
Residual factor for significantly intense reflections | 0.0465 |
Weighted residual factors for significantly intense reflections | 0.1505 |
Weighted residual factors for all reflections included in the refinement | 0.1558 |
Goodness-of-fit parameter for all reflections included in the refinement | 1.054 |
Diffraction radiation wavelength | 1.54178 Å |
Diffraction radiation type | CuKα |