Information card for entry 7220325
Formula | C24 H13 N0 O13 Zn |
Calculated formula | C24 H13 O13 Zn |
Title of publication | Structural variability, unusual thermochromic luminescence and nitrobenzene sensing properties of five Zn(ii) coordination polymers assembled from a terphenyl-hexacarboxylate ligand |
Authors of publication | Wan, Xiu-Yan; Jiang, Fei-Long; Chen, Lian; Pan, Jie; Zhou, Kang; Su, Kong-Zhao; Pang, Jian-Dong; Lyu, Guang-Xun; Hong, Mao-Chun |
Journal of publication | CrystEngComm |
Year of publication | 2015 |
Journal volume | 17 |
Journal issue | 20 |
Pages of publication | 3829 |
a | 11.0076 ± 0.0004 Å |
b | 21.4138 ± 0.0008 Å |
c | 13.7391 ± 0.0006 Å |
α | 90° |
β | 108.52 ± 0.005° |
γ | 90° |
Cell volume | 3070.8 ± 0.2 Å3 |
Cell temperature | 100 ± 2 K |
Ambient diffraction temperature | 100 ± 2 K |
Number of distinct elements | 5 |
Space group number | 14 |
Hermann-Mauguin space group symbol | P 1 21/c 1 |
Hall space group symbol | -P 2ybc |
Residual factor for all reflections | 0.0624 |
Residual factor for significantly intense reflections | 0.0457 |
Weighted residual factors for significantly intense reflections | 0.0989 |
Weighted residual factors for all reflections included in the refinement | 0.1056 |
Goodness-of-fit parameter for all reflections included in the refinement | 1.001 |
Diffraction radiation wavelength | 1.54184 Å |
Diffraction radiation type | CuKα |