Information card for entry 7220327
Formula | C16 H11 N O10 Zn2 |
Calculated formula | C16 H11 N O10 Zn2 |
Title of publication | Structural variability, unusual thermochromic luminescence and nitrobenzene sensing properties of five Zn(ii) coordination polymers assembled from a terphenyl-hexacarboxylate ligand |
Authors of publication | Wan, Xiu-Yan; Jiang, Fei-Long; Chen, Lian; Pan, Jie; Zhou, Kang; Su, Kong-Zhao; Pang, Jian-Dong; Lyu, Guang-Xun; Hong, Mao-Chun |
Journal of publication | CrystEngComm |
Year of publication | 2015 |
Journal volume | 17 |
Journal issue | 20 |
Pages of publication | 3829 |
a | 12.024 ± 0.003 Å |
b | 13.773 ± 0.004 Å |
c | 15.85 ± 0.004 Å |
α | 90° |
β | 99.093 ± 0.005° |
γ | 90° |
Cell volume | 2591.9 ± 1.2 Å3 |
Cell temperature | 100 ± 2 K |
Ambient diffraction temperature | 100 ± 2 K |
Number of distinct elements | 5 |
Space group number | 14 |
Hermann-Mauguin space group symbol | P 1 21/c 1 |
Hall space group symbol | -P 2ybc |
Residual factor for all reflections | 0.0523 |
Residual factor for significantly intense reflections | 0.0439 |
Weighted residual factors for significantly intense reflections | 0.1314 |
Weighted residual factors for all reflections included in the refinement | 0.1359 |
Goodness-of-fit parameter for all reflections included in the refinement | 1.039 |
Diffraction radiation wavelength | 0.71073 Å |
Diffraction radiation type | MoKα |