Information card for entry 7220326
Formula | C17 H20 N2 O8.5 Zn |
Calculated formula | C17 H20 N2 O8.5 Zn |
Title of publication | Structural variability, unusual thermochromic luminescence and nitrobenzene sensing properties of five Zn(ii) coordination polymers assembled from a terphenyl-hexacarboxylate ligand |
Authors of publication | Wan, Xiu-Yan; Jiang, Fei-Long; Chen, Lian; Pan, Jie; Zhou, Kang; Su, Kong-Zhao; Pang, Jian-Dong; Lyu, Guang-Xun; Hong, Mao-Chun |
Journal of publication | CrystEngComm |
Year of publication | 2015 |
Journal volume | 17 |
Journal issue | 20 |
Pages of publication | 3829 |
a | 18.3439 ± 0.0003 Å |
b | 8.809 ± 0.0001 Å |
c | 23.4388 ± 0.0004 Å |
α | 90° |
β | 101.965 ± 0.002° |
γ | 90° |
Cell volume | 3705.22 ± 0.1 Å3 |
Cell temperature | 100 ± 2 K |
Ambient diffraction temperature | 100 ± 2 K |
Number of distinct elements | 5 |
Space group number | 15 |
Hermann-Mauguin space group symbol | C 1 2/c 1 |
Hall space group symbol | -C 2yc |
Residual factor for all reflections | 0.0568 |
Residual factor for significantly intense reflections | 0.0548 |
Weighted residual factors for significantly intense reflections | 0.1477 |
Weighted residual factors for all reflections included in the refinement | 0.1492 |
Goodness-of-fit parameter for all reflections included in the refinement | 1.06 |
Diffraction radiation wavelength | 1.54184 Å |
Diffraction radiation type | CuKα |