Information card for entry 7220342
Formula | C17 H23 Fe N7 Se2 |
Calculated formula | C17 H23 Fe N7 Se2 |
SMILES | c12[n]3[Fe]456([N](=C(c3ccc2)C)CC[NH]6CC[NH]5CC[N]4=C1C)(N=C=[Se])N=C=[Se] |
Title of publication | Towards synergy between spin-crossover and metal‒ligand bond break in molecular crystals: structural investigations of eight seven-coordinated Fe(ii) macrocyclic complexes |
Authors of publication | Wang, Hongfeng; Grosjean, Arnaud; Sinito, Chiara; Kaiba, Abdellah; Baldé, Chérif; Desplanches, Cédric; Létard, Jean-François; Guionneau, Philippe |
Journal of publication | CrystEngComm |
Year of publication | 2015 |
Journal volume | 17 |
Journal issue | 22 |
Pages of publication | 4075 |
a | 7.275 ± 0.002 Å |
b | 11.692 ± 0.004 Å |
c | 12.76 ± 0.004 Å |
α | 85.868 ± 0.002° |
β | 76.764 ± 0.002° |
γ | 85.302 ± 0.002° |
Cell volume | 1051.4 ± 0.6 Å3 |
Cell temperature | 293 ± 2 K |
Ambient diffraction temperature | 293 ± 2 K |
Number of distinct elements | 5 |
Space group number | 2 |
Hermann-Mauguin space group symbol | P -1 |
Hall space group symbol | -P 1 |
Residual factor for all reflections | 0.043 |
Residual factor for significantly intense reflections | 0.0349 |
Weighted residual factors for significantly intense reflections | 0.0885 |
Weighted residual factors for all reflections included in the refinement | 0.0938 |
Goodness-of-fit parameter for all reflections included in the refinement | 1.035 |
Diffraction radiation wavelength | 0.71073 Å |
Diffraction radiation type | MoKα |