Information card for entry 7220343
Formula | C18 H25 Fe N7 S2 |
Calculated formula | C18 H25 Fe N7 S2 |
Title of publication | Towards synergy between spin-crossover and metal‒ligand bond break in molecular crystals: structural investigations of eight seven-coordinated Fe(ii) macrocyclic complexes |
Authors of publication | Wang, Hongfeng; Grosjean, Arnaud; Sinito, Chiara; Kaiba, Abdellah; Baldé, Chérif; Desplanches, Cédric; Létard, Jean-François; Guionneau, Philippe |
Journal of publication | CrystEngComm |
Year of publication | 2015 |
Journal volume | 17 |
Journal issue | 22 |
Pages of publication | 4075 |
a | 7.6106 ± 0.0001 Å |
b | 11.3658 ± 0.0002 Å |
c | 23.8383 ± 0.0005 Å |
α | 90° |
β | 93.826 ± 0.001° |
γ | 90° |
Cell volume | 2057.43 ± 0.06 Å3 |
Cell temperature | 110 ± 2 K |
Ambient diffraction temperature | 110 ± 2 K |
Number of distinct elements | 5 |
Space group number | 14 |
Hermann-Mauguin space group symbol | P 1 21/n 1 |
Hall space group symbol | -P 2yn |
Residual factor for all reflections | 0.0558 |
Residual factor for significantly intense reflections | 0.0421 |
Weighted residual factors for significantly intense reflections | 0.0835 |
Weighted residual factors for all reflections included in the refinement | 0.0876 |
Goodness-of-fit parameter for all reflections included in the refinement | 1.158 |
Diffraction radiation wavelength | 0.71073 Å |
Diffraction radiation type | MoKα |