Information card for entry 7220344
Formula | C18 H25 Fe N7 S2 |
Calculated formula | C18 H25 Fe N7 S2 |
SMILES | [Fe]1234(N=C=S)([N]5=C(c6cccc([n]16)C(=[N]2CC[NH]4CC[NH]3CCC5)C)C)N=C=S |
Title of publication | Towards synergy between spin-crossover and metal‒ligand bond break in molecular crystals: structural investigations of eight seven-coordinated Fe(ii) macrocyclic complexes |
Authors of publication | Wang, Hongfeng; Grosjean, Arnaud; Sinito, Chiara; Kaiba, Abdellah; Baldé, Chérif; Desplanches, Cédric; Létard, Jean-François; Guionneau, Philippe |
Journal of publication | CrystEngComm |
Year of publication | 2015 |
Journal volume | 17 |
Journal issue | 22 |
Pages of publication | 4075 |
a | 7.6865 ± 0.0002 Å |
b | 11.5038 ± 0.0004 Å |
c | 24.0051 ± 0.0007 Å |
α | 90° |
β | 85.856 ± 0.002° |
γ | 90° |
Cell volume | 2117.08 ± 0.11 Å3 |
Cell temperature | 293 ± 2 K |
Ambient diffraction temperature | 293 ± 2 K |
Number of distinct elements | 5 |
Space group number | 14 |
Hermann-Mauguin space group symbol | P 1 21/n 1 |
Hall space group symbol | -P 2yn |
Residual factor for all reflections | 0.0764 |
Residual factor for significantly intense reflections | 0.0585 |
Weighted residual factors for significantly intense reflections | 0.1557 |
Weighted residual factors for all reflections included in the refinement | 0.1666 |
Goodness-of-fit parameter for all reflections included in the refinement | 1.076 |
Diffraction radiation wavelength | 0.71073 Å |
Diffraction radiation type | MoKα |