Information card for entry 7220387
Formula |
C H7 Cu N9 |
Calculated formula |
C H7 Cu N9 |
Title of publication |
Tetrazolate‒azido‒copper(ii) coordination polymers: tuned synthesis, structure, and magnetic properties |
Authors of publication |
Xie, Ya-Bo; Gan, Lei; Carolina Sañudo, E.; Zheng, Haiyang; Zhao, Jiongpeng; Zhao, Minjian; Wang, Bin; Li, Jian-Rong |
Journal of publication |
CrystEngComm |
Year of publication |
2015 |
Journal volume |
17 |
Journal issue |
22 |
Pages of publication |
4136 |
a |
11.804 ± 0.002 Å |
b |
5.7178 ± 0.0011 Å |
c |
10.984 ± 0.002 Å |
α |
90° |
β |
115.84 ± 0.03° |
γ |
90° |
Cell volume |
667.2 ± 0.3 Å3 |
Cell temperature |
293 ± 2 K |
Ambient diffraction temperature |
293 ± 2 K |
Number of distinct elements |
4 |
Space group number |
15 |
Hermann-Mauguin space group symbol |
C 1 2/c 1 |
Hall space group symbol |
-C 2yc |
Residual factor for all reflections |
0.0336 |
Residual factor for significantly intense reflections |
0.0318 |
Weighted residual factors for significantly intense reflections |
0.0893 |
Weighted residual factors for all reflections included in the refinement |
0.0901 |
Goodness-of-fit parameter for all reflections included in the refinement |
1.142 |
Diffraction radiation wavelength |
0.71073 Å |
Diffraction radiation type |
MoKα |
Yes |
No |
No |