Information card for entry 7220388
Formula | C28 H Cd2 N4 O9 |
Calculated formula | C20 H18 Cd2 N8 O13 |
Title of publication | Construction of variable dimensional cadmium(ii) coordination polymers from pyridine-2,3-dicarboxylic acid |
Authors of publication | Yin, Wen-Xia; Liu, Yi-Ting; Ding, Yu-Jia; Lin, Qiang; Lin, Xiao-Ming; Wu, Chun-Lei; Yao, Xiang-Dong; Cai, Yue-Peng |
Journal of publication | CrystEngComm |
Year of publication | 2015 |
Journal volume | 17 |
Journal issue | 19 |
Pages of publication | 3619 |
a | 13.3217 ± 0.0002 Å |
b | 11.7975 ± 0.0002 Å |
c | 23.3963 ± 0.0005 Å |
α | 90° |
β | 123.48 ± 0.002° |
γ | 90° |
Cell volume | 3066.93 ± 0.12 Å3 |
Cell temperature | 293 ± 2 K |
Ambient diffraction temperature | 293 ± 2 K |
Number of distinct elements | 5 |
Space group number | 14 |
Hermann-Mauguin space group symbol | P 1 21/c 1 |
Hall space group symbol | -P 2ybc |
Residual factor for all reflections | 0.0423 |
Residual factor for significantly intense reflections | 0.0382 |
Weighted residual factors for significantly intense reflections | 0.0838 |
Weighted residual factors for all reflections included in the refinement | 0.0862 |
Goodness-of-fit parameter for all reflections included in the refinement | 1.041 |
Diffraction radiation wavelength | 0.71073 Å |
Diffraction radiation type | MoKα |