Information card for entry 7220391
Formula | C7 H3 Cd N O4 |
Calculated formula | C7 H3 Cd N O4 |
Title of publication | Construction of variable dimensional cadmium(ii) coordination polymers from pyridine-2,3-dicarboxylic acid |
Authors of publication | Yin, Wen-Xia; Liu, Yi-Ting; Ding, Yu-Jia; Lin, Qiang; Lin, Xiao-Ming; Wu, Chun-Lei; Yao, Xiang-Dong; Cai, Yue-Peng |
Journal of publication | CrystEngComm |
Year of publication | 2015 |
Journal volume | 17 |
Journal issue | 19 |
Pages of publication | 3619 |
a | 10.7212 ± 0.0001 Å |
b | 7.7259 ± 0.0001 Å |
c | 8.678 ± 0.0001 Å |
α | 90° |
β | 110.037 ± 0.001° |
γ | 90° |
Cell volume | 675.298 ± 0.014 Å3 |
Cell temperature | 298 ± 2 K |
Ambient diffraction temperature | 298 ± 2 K |
Number of distinct elements | 5 |
Space group number | 14 |
Hermann-Mauguin space group symbol | P 1 21/c 1 |
Hall space group symbol | -P 2ybc |
Residual factor for all reflections | 0.0255 |
Residual factor for significantly intense reflections | 0.0235 |
Weighted residual factors for significantly intense reflections | 0.0596 |
Weighted residual factors for all reflections included in the refinement | 0.061 |
Goodness-of-fit parameter for all reflections included in the refinement | 1.082 |
Diffraction radiation wavelength | 0.71073 Å |
Diffraction radiation type | MoKα |