Information card for entry 7220390
Formula | C27 H29 Cd2 N7 O15 |
Calculated formula | C27 H29 Cd2 N7 O15 |
Title of publication | Construction of variable dimensional cadmium(ii) coordination polymers from pyridine-2,3-dicarboxylic acid |
Authors of publication | Yin, Wen-Xia; Liu, Yi-Ting; Ding, Yu-Jia; Lin, Qiang; Lin, Xiao-Ming; Wu, Chun-Lei; Yao, Xiang-Dong; Cai, Yue-Peng |
Journal of publication | CrystEngComm |
Year of publication | 2015 |
Journal volume | 17 |
Journal issue | 19 |
Pages of publication | 3619 |
a | 15.5653 ± 0.0018 Å |
b | 15.3856 ± 0.0018 Å |
c | 14.8364 ± 0.0017 Å |
α | 90° |
β | 109.725 ± 0.001° |
γ | 90° |
Cell volume | 3344.6 ± 0.7 Å3 |
Cell temperature | 296 ± 2 K |
Ambient diffraction temperature | 296 ± 2 K |
Number of distinct elements | 5 |
Space group number | 14 |
Hermann-Mauguin space group symbol | P 1 21/c 1 |
Hall space group symbol | -P 2ybc |
Residual factor for all reflections | 0.0846 |
Residual factor for significantly intense reflections | 0.0664 |
Weighted residual factors for significantly intense reflections | 0.1844 |
Weighted residual factors for all reflections included in the refinement | 0.203 |
Goodness-of-fit parameter for all reflections included in the refinement | 0.98 |
Diffraction radiation wavelength | 0.71073 Å |
Diffraction radiation type | MoKα |