Information card for entry 7220521
Formula | C66.25 H47.75 N2.25 O11.25 Zn2 |
Calculated formula | C62 H42 N2 O10 Zn2 |
Title of publication | Observance of a large conformational change associated with the rotation of the naphthyl groups during the photodimerization of criss-cross aligned CC bonds within a 2D coordination polymer |
Authors of publication | Hu, Fei-Long; Wang, Shu-Long; Abrahams, Brendan F.; Lang, Jian-Ping |
Journal of publication | CrystEngComm |
Year of publication | 2015 |
Journal volume | 17 |
Journal issue | 26 |
Pages of publication | 4903 |
a | 14.934 ± 0.003 Å |
b | 24.781 ± 0.004 Å |
c | 16.383 ± 0.003 Å |
α | 90° |
β | 109.435 ± 0.004° |
γ | 90° |
Cell volume | 5717.5 ± 1.8 Å3 |
Cell temperature | 273 ± 2 K |
Ambient diffraction temperature | 273 ± 2 K |
Number of distinct elements | 5 |
Space group number | 9 |
Hermann-Mauguin space group symbol | C 1 c 1 |
Hall space group symbol | C -2yc |
Residual factor for all reflections | 0.1129 |
Residual factor for significantly intense reflections | 0.1051 |
Weighted residual factors for significantly intense reflections | 0.2715 |
Weighted residual factors for all reflections included in the refinement | 0.2791 |
Goodness-of-fit parameter for all reflections included in the refinement | 1.164 |
Diffraction radiation wavelength | 0.71073 Å |
Diffraction radiation type | MoKα |