Information card for entry 7220522
Formula | C66.25 H45.25 N2.25 O10 Zn2 |
Calculated formula | C62 H42 N2 O10 Zn2 |
Title of publication | Observance of a large conformational change associated with the rotation of the naphthyl groups during the photodimerization of criss-cross aligned CC bonds within a 2D coordination polymer |
Authors of publication | Hu, Fei-Long; Wang, Shu-Long; Abrahams, Brendan F.; Lang, Jian-Ping |
Journal of publication | CrystEngComm |
Year of publication | 2015 |
Journal volume | 17 |
Journal issue | 26 |
Pages of publication | 4903 |
a | 14.5426 ± 0.0006 Å |
b | 25.0252 ± 0.0007 Å |
c | 16.5912 ± 0.0007 Å |
α | 90° |
β | 109.841 ± 0.005° |
γ | 90° |
Cell volume | 5679.6 ± 0.4 Å3 |
Cell temperature | 293 ± 2 K |
Ambient diffraction temperature | 293 ± 2 K |
Number of distinct elements | 5 |
Space group number | 14 |
Hermann-Mauguin space group symbol | P 1 21/c 1 |
Hall space group symbol | -P 2ybc |
Residual factor for all reflections | 0.1297 |
Residual factor for significantly intense reflections | 0.099 |
Weighted residual factors for significantly intense reflections | 0.2479 |
Weighted residual factors for all reflections included in the refinement | 0.2645 |
Goodness-of-fit parameter for all reflections included in the refinement | 1.077 |
Diffraction radiation wavelength | 0.71073 Å |
Diffraction radiation type | MoKα |