Information card for entry 7220556
Formula | C26 H33 Cl N2 O5 |
Calculated formula | C26 H33 Cl N2 O5 |
SMILES | [Cl-].O(C(=O)C(O)(c1ccccc1)c1ccccc1)C1C[C@H]2[N+]3([C@H](CC2)C1)CCCC3.O=N(=O)C |
Title of publication | Systematic solvate screening of trospium chloride: discovering hydrates of a long-established pharmaceutical |
Authors of publication | Sládková, V.; Skalická, T.; Skořepová, E.; Čejka, J.; Eigner, V.; Kratochvíl, B. |
Journal of publication | CrystEngComm |
Year of publication | 2015 |
Journal volume | 17 |
Journal issue | 25 |
Pages of publication | 4712 |
a | 9.9289 ± 0.0003 Å |
b | 9.429 ± 0.0003 Å |
c | 26.8357 ± 0.001 Å |
α | 90° |
β | 97.556 ± 0.003° |
γ | 90° |
Cell volume | 2490.53 ± 0.14 Å3 |
Cell temperature | 180 K |
Ambient diffraction temperature | 180 K |
Number of distinct elements | 5 |
Space group number | 14 |
Hermann-Mauguin space group symbol | P 1 21/n 1 |
Hall space group symbol | -P 2yn |
Residual factor for all reflections | 0.0587 |
Residual factor for significantly intense reflections | 0.0506 |
Weighted residual factors for significantly intense reflections | 0.1305 |
Weighted residual factors for all reflections included in the refinement | 0.1368 |
Goodness-of-fit parameter for significantly intense reflections | 1.93 |
Goodness-of-fit parameter for all reflections included in the refinement | 1.82 |
Diffraction radiation probe | x-ray |
Diffraction radiation wavelength | 1.54184 Å |
Diffraction radiation type | CuKα |