Information card for entry 7220557
Formula | C28 H35 Cl N2 O3 |
Calculated formula | C28 H35 Cl N2 O3 |
Title of publication | Systematic solvate screening of trospium chloride: discovering hydrates of a long-established pharmaceutical |
Authors of publication | Sládková, V.; Skalická, T.; Skořepová, E.; Čejka, J.; Eigner, V.; Kratochvíl, B. |
Journal of publication | CrystEngComm |
Year of publication | 2015 |
Journal volume | 17 |
Journal issue | 25 |
Pages of publication | 4712 |
a | 15.1562 ± 0.0007 Å |
b | 9.536 ± 0.0003 Å |
c | 18.8677 ± 0.0008 Å |
α | 90° |
β | 109.782 ± 0.004° |
γ | 90° |
Cell volume | 2566.02 ± 0.19 Å3 |
Cell temperature | 150 K |
Ambient diffraction temperature | 150 K |
Number of distinct elements | 5 |
Space group number | 14 |
Hermann-Mauguin space group symbol | P 1 21/n 1 |
Hall space group symbol | -P 2yn |
Residual factor for all reflections | 0.0488 |
Residual factor for significantly intense reflections | 0.0416 |
Weighted residual factors for significantly intense reflections | 0.1108 |
Weighted residual factors for all reflections included in the refinement | 0.1158 |
Goodness-of-fit parameter for significantly intense reflections | 1.92 |
Goodness-of-fit parameter for all reflections included in the refinement | 1.83 |
Diffraction radiation probe | x-ray |
Diffraction radiation wavelength | 1.5418 Å |
Diffraction radiation type | CuKα |