Information card for entry 7220559
Formula | C25 H34 Cl N O5 |
Calculated formula | C25 H34 Cl N O5 |
SMILES | [Cl-].O(C(=O)C(O)(c1ccccc1)c1ccccc1)C1C[C@H]2[N+]3([C@H](CC2)C1)CCCC3.O.O |
Title of publication | Systematic solvate screening of trospium chloride: discovering hydrates of a long-established pharmaceutical |
Authors of publication | Sládková, V.; Skalická, T.; Skořepová, E.; Čejka, J.; Eigner, V.; Kratochvíl, B. |
Journal of publication | CrystEngComm |
Year of publication | 2015 |
Journal volume | 17 |
Journal issue | 25 |
Pages of publication | 4712 |
a | 19.1988 ± 0.0007 Å |
b | 13.1107 ± 0.0003 Å |
c | 9.5387 ± 0.0003 Å |
α | 90° |
β | 98.175 ± 0.003° |
γ | 90° |
Cell volume | 2376.59 ± 0.13 Å3 |
Cell temperature | 120 K |
Ambient diffraction temperature | 120 K |
Number of distinct elements | 5 |
Space group number | 14 |
Hermann-Mauguin space group symbol | P 1 21/c 1 |
Hall space group symbol | -P 2ybc |
Residual factor for all reflections | 0.0409 |
Residual factor for significantly intense reflections | 0.0362 |
Weighted residual factors for significantly intense reflections | 0.0958 |
Weighted residual factors for all reflections included in the refinement | 0.0988 |
Goodness-of-fit parameter for significantly intense reflections | 1.62 |
Goodness-of-fit parameter for all reflections included in the refinement | 1.56 |
Diffraction radiation probe | x-ray |
Diffraction radiation wavelength | 1.54184 Å |
Diffraction radiation type | CuKα |